نیو جرسی
preferred label: New Jersey @en
type: Concept
narrower: نیوارک نیو جرسی

نیوارک نیو جرسی
scope note: شهری در خلیج نیوارک کاملا غرب شهر جرسی و شهر نیویورک در شمال شرق نیو جرسی.
broader: نیو جرسی
preferred label: Newark New Jersey @en
type: Concept