ماگدالنا نیومکزیکو
scope note: نام یک روستا و مرکز معدن‌کاری در غرب مرکز نیومکزیکو.
broader: نیومکزیکو
preferred label: Mgdalena New Mexico @en
type: Concept

نیومکزیکو
preferred label: New Mexico @en
type: Concept
narrower: ماگدالنا نیومکزیکو