یخچال کاسکید جنوبی
scope note: نزدیک کوه موگان در شمال پارک ملی کاسکید، شمال غرب واشنگتن
broader: ناحیه اسکاجیت واشنگتن
preferred label: South Cascade Glacier @en
type: Concept

ناحیه اسکاجیت واشنگتن
preferred label: Skagit County Washington @en
type: Concept
narrower: یخچال کاسکید جنوبی