ناحیه کلیکیتات واشنگتن
scope note: در کناره رود کلمبیا در جنوب مرکز واشنگتن.
broader: واشنگتن
preferred label: Klickitat County Washington @en
type: Concept

واشنگتن
preferred label: Washington @en
type: Concept
narrower: ناحیه کلیکیتات واشنگتن