تکامل زیستی
preferred label: biologic evolution @en
type: Concept
related: انتخاب طبیعی

داروین‌گرایی
preferred label: Darwinism @en
type: Concept
related: انتخاب طبیعی

انتخاب طبیعی
scope note: تکامل یک گونه به صورتی که خصوصیات موثر در بقا و تولیدمثل ارگانیسم ها به ارث رسیده و خصوصیاتی که موثر نیستند منتقل نمی شوند.
related: داروین‌گرایی
related: تکامل زیستی
preferred label: natural selection @en
type: Concept