میانبار کانی
preferred label: mineral inclusion @en
type: Concept
related: الیوین سن کارلوس

ناحیه گیلا آریزونا
preferred label: Gila County Arizona @en
type: Concept
related: الیوین سن کارلوس

الیوین سن کارلوس
scope note: تداخل‌های پریدوتیت و پیروکسنیت از سن کارلوس، آریزونا، 30 کیلومتری شرق گلوب، آریزونا
related: ناحیه گیلا آریزونا
related: میانبار کانی
preferred label: San Carlos olivine @en
type: Concept