اکسیدها
preferred label: oxides @en
type: Concept
narrower: پریکلاز

پریکلاز
scope note: اکسید طبیعی منیزیم، دارای سیستم مکعبی، مکعب‌های آن بیرنگ، به آسانی به تیغه‌ها و یا فیبرهای بروسیت تبدیل می‌شود.
broader: اکسیدها
preferred label: periclase @en
type: Concept