پشته میان‌اقیانوسی
preferred label: mid-ocean ridge @en
type: Concept
related: پشته کارلسبرگ

پشته کارلسبرگ
alternative label: پشته ميان‌اقيانوسی عربی-هندی
scope note: بین جمهوری سومالی و سیکلز در سمت غرب، و جزایر مالدیو و لاکادیو در سمت شرق.
related: پشته میان‌اقیانوسی
broader: اقیانوس هند
preferred label: Carlsberg Ridge @en
type: Concept

اقیانوس هند
preferred label: Indian Ocean @en
type: Concept
narrower: پشته کارلسبرگ