پنجه آبرفتی بنگال
scope note: پنجه آبرفتی زیر دریایی که از تقریباً جنوب و غرب سیستم دلتای گنگ- براهماپوترا تا خط استوا ادامه یافته است.
related: خلیج بنگال
broader: اقیانوس هند
preferred label: Bengal Fan @en
type: Concept

خلیج بنگال
preferred label: Bay of Bengal @en
type: Concept
related: پنجه آبرفتی بنگال

اقیانوس هند
preferred label: Indian Ocean @en
type: Concept
narrower: پنجه آبرفتی بنگال