اقیانوس هند
preferred label: Indian Ocean @en
type: Concept
narrower: فلات نچرالیست

فلات نچرالیست
scope note: جنوب شرق اقیانوس آرام کناره جنوب غربی استرالیا.
broader: اقیانوس هند
preferred label: Naturaliste Plateau @en
type: Concept