زبانه اقیانوس
scope note: تنگه ای مابین جزایر آندروس در غرب و جزیره نیوپروویدسن و اگزوماکیس در شرق.
broader: اطلس شمالی
preferred label: Tongue of the Ocean @en
type: Concept

اطلس شمالی
preferred label: North Atlantic @en
type: Concept
narrower: زبانه اقیانوس