ساحل لیتل باهاما
preferred label: Little Bahama Bank @en
type: Concept
related: ساحل باهامای بزرگ

اطلس شمالی
preferred label: North Atlantic @en
type: Concept
narrower: ساحل باهامای بزرگ

ساحل باهامای بزرگ
scope note: پایاب بزرگی در باهاما جنوب شرق میامی و امتداد یافته مابین جزیره کوبا و جزیره آندروس.
related: ساحل لیتل باهاما
broader: اطلس شمالی
preferred label: Great Bahama Bank @en
type: Concept