خلیج اسپنسر
preferred label: Spencer Gulf @en
type: Concept
related: جزیره اسپیلزبی

جزیره اسپیلزبی
scope note: بزرگترین جزیره جزایر سرجوزف در خلیج اسپنسر حدود 5 مایلی کناره ساحل جنوب شرق شبه جزیره ایره
related: خلیج اسپنسر
broader: استرالیای جنوبی
preferred label: Spilsby Island @en
type: Concept

استرالیای جنوبی
preferred label: South Australia @en
type: Concept
narrower: جزیره اسپیلزبی