استرالیای غربی
preferred label: Western Australia @en
type: Concept
narrower: تنگه ویتنوم

تنگه ویتنوم
scope note: نزدیک ویتنوم، روستای شمال جنوب شرق منتهی‌الیه رشته‌کوه هامرسلی در شمال غرب استرالیای غربی.
related: سازند آهن بروکمن
broader: استرالیای غربی
preferred label: Wittenoom Gorge @en
type: Concept

سازند آهن بروکمن
preferred label: Brockman Iron Formation @en
type: Concept
related: تنگه ویتنوم