خلیج پورت فیلیپ
preferred label: Port Phillip Bay @en
type: Concept
related: ملبورن استرالیا

ملبورن استرالیا
scope note: شهری در شمال خلیج پورت فیلیپ، جنوب شرق استرالیا در دهانه رود یارا.
related: خلیج پورت فیلیپ
broader: ویکتوریا استرالیا
preferred label: Melbourne Australia @en
type: Concept

ویکتوریا استرالیا
preferred label: Victoria Australia @en
type: Concept
narrower: ملبورن استرالیا