نیو ایرلند
scope note: جزیره ای در مجمع‌الجزایر بیسمارک شمال شرق بریتانیای جدید در جنوب غرب آرام.
related: مجمع‌الجزایر بیسمارک
broader: پاپوا گینه نو
preferred label: New Ireland @en
type: Concept

مجمع‌الجزایر بیسمارک
preferred label: Bismarck Archipelago @en
type: Concept
related: نیو ایرلند

پاپوا گینه نو
preferred label: Papua New Guinea @en
type: Concept
narrower: نیو ایرلند