بندر کی‌پارا
scope note: شاخابه فرعی اقیانوس آرام در ساحل غربی امتداد شمالی ایسلند شمالی.
related: جزیره شمالی
broader: زلاندنو
preferred label: Kaipara Harbor @en
type: Concept

زلاندنو
preferred label: New Zealand @en
type: Concept
narrower: بندر کی‌پارا

جزیره شمالی
preferred label: North Island @en
type: Concept
related: بندر کی‌پارا