توسکانی ایتالیا
preferred label: Tuscany Italy @en
type: Concept
narrower: پیزا ایتالیا

پیزا ایتالیا
scope note: شهر و ایالتی در شمال غرب توسکانی، غرب ایتالیا
broader: توسکانی ایتالیا
preferred label: Pisa Italy @en
type: Concept