ناپل ایتالیا
scope note: ایالت و شهری در کناره دریای تیرنه در غرب کامپانیا، جنوب ایتالیا.
broader: کامپانیا ایتالیا
preferred label: Naples Italy @en
type: Concept

کامپانیا ایتالیا
preferred label: Campania Italy @en
type: Concept
narrower: ناپل ایتالیا