لومباردی ایتالیا
preferred label: Lombardy Italy @en
type: Concept
narrower: میلان ایتالیا

میلان ایتالیا
scope note: ایالتی شامل شهری در غرب لومباردی، شمال ایتالیا.
broader: لومباردی ایتالیا
preferred label: Milan Italy @en
type: Concept