ورونا ایتالیا
scope note: ایالت و شهری در غرب ونته‌تو، شمال شرق ایتالیا
broader: ونتو ایتالیا
preferred label: Verona Italy @en
type: Concept

ونتو ایتالیا
preferred label: Veneto Italy @en
type: Concept
narrower: ورونا ایتالیا