ونتو ایتالیا
preferred label: Veneto Italy @en
type: Concept
narrower: ونیز ایتالیا

ونیز ایتالیا
scope note: ایالت و شهری در خلیج ونیز شمال دریای آدریاتیک در شرق ونتو، شمال شرق ایتالیا
broader: ونتو ایتالیا
preferred label: Venice Italy @en
type: Concept