حوضه دره آلماس
scope note: حوضه رودخانه‌ای در غرب مرکز ترانسیلوانیا
broader: ترانسیلوانیا
preferred label: Almas Valley Basin @en
type: Concept

ترانسیلوانیا
preferred label: Transylvania @en
type: Concept
narrower: حوضه دره آلماس