والاچیا
preferred label: Walachia @en
type: Concept
narrower: مونتنیا

مونتنیا
scope note: ناحیه ای و ایالتی قدیمی در شرق والاچیا، جنوب رومانی.
broader: والاچیا
preferred label: Muntenia @en
type: Concept