آندلس اسپانیا
preferred label: Andalusia Spain @en
type: Concept
narrower: مالاگا اسپانیا

مالاگا اسپانیا
scope note: در جنوب مرکز اسپانیا. تنها بیانگر نام یک ایالت است.
broader: آندلس اسپانیا
preferred label: Malaga Spain @en
type: Concept