اسپانیا
preferred label: Spain @en
type: Concept
narrower: تاراگونا اسپانیا

تاراگونا اسپانیا
scope note: ایالتی در کاتالونیا در جنوب شرق اسپانیا.
broader: اسپانیا
preferred label: Tarragona Spain @en
type: Concept