اسپانیا
preferred label: Spain @en
type: Concept
narrower: رشته‌کوه ایبریا

رشته‌کوه ایبریا
scope note: سیستم کوهستانی در لبه شرقی فلات بزرگ مرکزی.
broader: اسپانیا
preferred label: Iberian Mountains @en
type: Concept