لاکرونا اسپانیا
preferred label: La Coruna Spain @en
type: Concept
related: خلیج آروسا

گالیسیا اسپانیا
preferred label: Galicia Spain @en
type: Concept
narrower: خلیج آروسا

خلیج آروسا
scope note: در اقیانوس منجمد شمالی در غرب ما بین ایالت های لاکورنا و پونته ودرا (اسپانیا)
related: لاکرونا اسپانیا
broader: گالیسیا اسپانیا
preferred label: Arosa Bay @en
type: Concept