اسپانیا
preferred label: Spain @en
type: Concept
narrower: لاریوجا اسپانیا

لاریوجا اسپانیا
scope note: اتحادیه حکومتی و ایالتی در شمال مرکز اسپانیا.
broader: اسپانیا
preferred label: La Rioja Spain @en
type: Concept