منطقه لئون
preferred label: Leon Region @en
type: Concept
narrower: لئون اسپانیا

لئون اسپانیا
scope note: تنها بیانگر شهری در ایالتی در شمال غرب اسپانیا.
broader: منطقه لئون
preferred label: Leon Spain @en
type: Concept