منطقه مورسیا
preferred label: Murcia Region @en
type: Concept
narrower: مورسیا اسپانیا

جومیلا اسپانیا
preferred label: Jumilla Spain @en
type: Concept
broader: مورسیا اسپانیا

مورسیا اسپانیا
scope note: بیانگر جامعه خودمختار و ایالت همزاد آن است که در جنوب شرق اسپانیا واقع شده است.
narrower: جومیلا اسپانیا
broader: منطقه مورسیا
preferred label: Murcia Spain @en
type: Concept