پرتغال
preferred label: Portugal @en
type: Concept
narrower: لیسبون پرتغال

لیسبون پرتغال
scope note: پایتخت و شهر بندری، ناحیه لیسوبا. جنوب غرب ساحل پرتغال.
broader: پرتغال
preferred label: Lisbon Portugal @en
type: Concept