صربستان
preferred label: Serbia @en
type: Concept
narrower: بلگراد یوگسلاوی

بلگراد یوگسلاوی
alternative label: بوگراد یوگسلاوی
scope note: شهری در رودخانه دانوب در شمال مرکز سیبری
broader: صربستان
preferred label: Belgrade Yugoslavia @en
type: Concept