پیکاردی
scope note: ناحیه تاریخی در منتهاالیه شمالی فرانسه. حدود کانال انگلیسی مابین کالایس در شمال و ترپورت در جنوب، و در جهت شرق بموازات رود سوم و رود اوسین علیا تا مرز بلژیک امتداد دارد
broader: فرانسه
preferred label: Picardy @en
type: Concept

فرانسه
preferred label: France @en
type: Concept
narrower: پیکاردی