فرانسه
preferred label: France @en
type: Concept
narrower: رودخانه ساین

رودخانه ساین
scope note: از ایالت کوت-داور در شرق سرچشمه گرفته و در جهت شمال غرب از پاریس عبور کرده و به کانال انگلیسی میریزد
related: دره ساین
broader: فرانسه
preferred label: Seine River @en
type: Concept

دره ساین
preferred label: Seine Valley @en
type: Concept
related: رودخانه ساین