فرانسه
preferred label: France @en
type: Concept
narrower: فلات سنگ آهکی

توده مرکزی (ماسیف سانترال)
preferred label: Central Massif @en
type: Concept
related: فلات سنگ آهکی

فلات سنگ آهکی
scope note: یک صفحه خشک سنگ آهکی مربوط به ژوراسیک جنوب ماسیف سانترال در جنوب و جنوب غرب فرانسه.
related: توده مرکزی (ماسیف سانترال)
broader: فرانسه
preferred label: causse @en
type: Concept