آیرشایر اسکاتلند
scope note: ایالت قدیمی در ناحیه استراتکلاید، جنوب غرب اسکاتلند
broader: ناحیه استراکلاید اسکاتلند
preferred label: Ayrshire Scotland @en
type: Concept

ناحیه استراکلاید اسکاتلند
preferred label: Strathclyde Region Scotland @en
type: Concept
narrower: آیرشایر اسکاتلند