نورفولک انگلستان
preferred label: Norfolk England @en
type: Concept
broader: آنجلیا شرقی

انگلستان
preferred label: England @en
type: Concept
narrower: آنجلیا شرقی

آنجلیا شرقی
scope note: منطقه ای شامل نواحی نورفولک و سافولک در دریای شمال در منتهاالیه شرقی انگلستان.
narrower: نورفولک انگلستان
broader: انگلستان
preferred label: East Anglia @en
type: Concept