پمبروک شایرولز
scope note: ناحیه‌ای قدیمی در جنوب غربی ولز بخشی از دیفد
broader: دیفد والز
preferred label: Pembrokeshire Wales @en
type: Concept

دیفد والز
preferred label: Dyfed Wales @en
type: Concept
narrower: پمبروک شایرولز