آلمان
preferred label: Germany @en
type: Concept
narrower: هایدلبرگ آلمان

هایدلبرگ آلمان
scope note: شهری در کناره رود نکار در شمال غرب بادنووتمبرگ.
broader: آلمان
preferred label: Heidelberg Germany @en
type: Concept