دره اودر
preferred label: Oder Valley @en
type: Concept
related: رودخانه وارتا

لهستان
preferred label: Poland @en
type: Concept
narrower: رودخانه وارتا

رودخانه وارتا
scope note: از شمال غرب کراکو آغاز و در جهت شمال غرب و غرب به رود اودر در کوسترزین مرز آلمان می ریزد
related: دره اودر
broader: لهستان
preferred label: Warta River @en
type: Concept