مجارستان
preferred label: Hungary @en
type: Concept
narrower: بوداپست مجارستان

بوداپست مجارستان
alternative label: ناحیه بوداپست
scope note: شهری در هر دو سوی رود دانوب در شمال مرکز مجارستان. پایتخت ناحیه پست.
broader: مجارستان
preferred label: Budapest Hungary @en
type: Concept