کاستروما فدراسیون روسیه
scope note: ناحیه‌ای خودمختار شامل شهری در کرانه چپ رود ولگا.
broader: اروپا
preferred label: Kostroma Russian Federation @en
type: Concept

اروپا
preferred label: Europe @en
type: Concept
narrower: کاستروما فدراسیون روسیه