اراتوستنین
scope note: چینه نگاری ماه. سنگهای اراتوستنین از سنگهای سیستم کوپرنیک قدیمی تر ولی از سنگهای سیستم ایمبرین جوانتر است.
related: ماه
preferred label: Eratosthenian @en
type: Concept

ماه
preferred label: Moon @en
type: Concept
related: اراتوستنین