استعمال انفعالی دخانیات
type: Concept
alternative label: سيگار كشيدن بي‌اختياري
broader: استعمال دخانیات
preferred label: Passive smoking @en
scope note: استنشاق دود دخانیات رها شده در فضا یا دود بازدم استعمال‌كنندگان دخانیات توسط دیگران. دود مستقیم ناشی از سوختن دخانیات كه آن را جریان جانبی می نامند، بیشتر از دود بازدم استعمال‌كنندگان دخانیات، مواد سمی و سرطانزا دارد.

استعمال دخانیات
type: Concept
narrower: استعمال انفعالی دخانیات
preferred label: Smoking @en