گروه خطرزا
type: Concept
preferred label: Risk group @en
related: گروه هدف

گروه هدف
type: Concept
alternative label: گروه آماج
broader: گروه
preferred label: Target group @en
related: گروه خطرزا
scope note: گروهی كه قصد استنباط از آن در نظر باشد. این اصطلاح گاهی برای نشان دادن جمعیتی كه نمونه از آن گرفته شده و گاهی برای نشان دادن هر جمعیت مورد مطالعه كه استنباط در باره آن لازم باشد، به‌كار می‌رود.

گروه
type: Concept
narrower: گروه هدف
preferred label: Group @en