کربوهیدرات
type: Concept
alternative label: هيدرات‌كربن
broader: عنصر غذایی
preferred label: Carbohydrate @en
related: فراورده غلات
scope note: تركیب آلی از كربن، هیدروژن و اكسیژن و مولد حرارت است و شامل نشاسته، قند و سلولز می‌شود.

عنصر غذایی
type: Concept
narrower: کربوهیدرات
preferred label: Nutritional component @en

فراورده غلات
type: Concept
preferred label: Cereal product @en
related: کربوهیدرات