چربی
type: Concept
broader: عنصر غذایی
preferred label: Lipid @en
related: کلسترول
scope note: لیپید نام علمی چربی است و شامل تری‌گلیسریدها، استرولها و سایر مواد چرب مانند كلسترول می‌شود.

عنصر غذایی
type: Concept
narrower: چربی
preferred label: Nutritional component @en

کلسترول
type: Concept
preferred label: Cholesterol @en
related: چربی