سندرم فرسودگی
type: Concept
alternative label: فرسودگي رواني كوتاه مدت
preferred label: Burnout syndrome @en
related: خستگی
related: فشار روانی
scope note: از بین رفتن قوای روانی كه گاهی با افسردگی همراه است و از كوشش برای یاری به بیماران روانی یا اشخاص تحت فشار روانی ناشی می‌شود.

خستگی
type: Concept
preferred label: Fatigue @en
related: سندرم فرسودگی

فشار روانی
type: Concept
preferred label: Stress @en
related: سندرم فرسودگی