بهداشت عمومی
type: Concept
broader: سلامت
preferred label: Public health @en
scope note: علم وهنر پیشگیری از بیماری، طولانی كردن زندگی و ارتقای بهداشتی از طریق مساعی سازمان‌یافته جامعه.

سلامت
type: Concept
narrower: بهداشت عمومی
preferred label: Health @en